Photos

  • Add Photos
  • View All

Videos

  • Add Videos
  • View All

C:\DSpace\dspace-5.2-src-release\dspace\bin>mvn package
[INFO] Scanning for projects...
[INFO] ------------------------------------------------------------------------
[INFO] BUILD FAILURE
[INFO] ------------------------------------------------------------------------
[INFO] Total time: 0.220 s
[INFO] Finished at: 2015-10-31T18:31:58+05:30
[INFO] Final Memory: 4M/15M
[INFO] ------------------------------------------------------------------------
[ERROR] The goal you specified requires a project to execute but there is no POM
 in this directory (C:\DSpace\dspace-5.2-src-release\dspace\bin). Please verify
you invoked Maven from the correct directory. -> [Help 1]
[ERROR]
[ERROR] To see the full stack trace of the errors, re-run Maven with the -e swit
ch.
[ERROR] Re-run Maven using the -X switch to enable full debug logging.
[ERROR]
[ERROR] For more information about the errors and possible solutions, please rea
d the following articles:
[ERROR] [Help 1] http://cwiki.apache.org/confluence/display/MAVEN/MissingProject
Exception

Dear Professionals,

Am tried to install DSpace but i got the above error, pls help me how to solve the above error.

 Thanking You.

Views: 752

Reply to This

Replies to This Forum

Dear Tanmay,

He is installing Dspace it on windows. You have provided the wrong source.

Dear Reddy,

You are running Mvn package command from wrong path. please use the following path

C:\DSpace\dspace-5.2-src-release\dspace>mvn package

For more info follow the link:

https://wiki.duraspace.org/display/DSPACE/Installing+DSpace+on+Windows

Dear

Mr. Ali is right. Go through from mvn package and check your system network.

Good luck! 

u can contact with dr sangeeta coal. in DELNET 

becoz delnet is also provide some assistance for it.

Dr.sangeeta Kaul.

Thanks for giving your valuable suggestions.

RSS

© 2019   Created by Badan Barman.   Powered by

Badges  |  Report an Issue  |  Terms of Service